HASTA NO,Yasi,Cinsiyet,PCR,Trombosit Dağılım Genişliği (PDW),Ortalama Trombosit Hacmi (MPV),Trombosit (PLT),Eritrosit Dağılım Genişliği (RDW),Ortalama Eritrosit Hacmi (MCV),Hemoglobin (HGB),Lenfosit Sayısı,Nötrofil Sayısı,Lökosit (WBC),CRP (Türbidimetrik),LDH,Kreatin kinaz (CK) (Serum/Plazma),Kreatin kinaz-MB (CK-MB) (Aktivite),Troponin I,Kreatinin,AST,ALT,"D-dimer, kantitatif",Procalcitonin,PT (INR),PT (sn),APTT
1,25,1,0,16.7,9.1,221,12.8,88.4,14.5,2.42,4.99,8.3,0.0,142.0,80.0,16.0,0.0,0.99,13.3,8.3,0.0,,1.16,10.5,30.9
2,34,1,1,16.1,8.5,193,12.4,88.9,15.2,3.03,3.56,7.1,0.0,197.0,110.0,17.0,0.0,0.88,21.7,22.7,0.0,0.0,0.99,8.86,31.3
3,66,1,1,18.0,8.1,162,14.6,87.7,15.7,0.67,4.01,5.4,1.0,464.0,142.0,,0.0,1.27,31.9,27.1,0.0,0.0,,,
4,56,1,1,16.3,8.2,219,13.7,88.0,15.4,1.36,2.87,4.7,1.0,276.0,310.0,31.0,0.0,0.93,66.3,75.9,0.0,0.0,1.56,14.5,39.9
5,38,1,1,16.3,7.4,251,13.6,79.0,13.3,2.02,2.35,4.9,1.0,223.0,121.0,27.0,0.0,0.69,29.6,38.6,0.0,0.0,1.0,8.96,25.9
6,50,1,1,16.4,8.8,235,13.1,88.6,13.9,2.16,5.65,9.3,0.0,193.0,,,,0.97,16.6,14.0,0.0,0.0,,,
7,47,1,0,16.7,7.4,344,13.4,91.4,16.2,1.04,4.45,6.2,0.0,201.0,104.0,20.0,0.0,0.74,18.3,13.3,0.0,,0.98,8.84,26.7
8,66,1,0,17.5,9.9,200,13.9,89.1,15.4,1.68,2.25,4.4,0.0,477.0,,86.0,0.0,1.07,41.4,26.4,0.0,0.0,,,
9,70,1,1,17.0,7.6,293,17.8,71.8,10.6,0.92,5.31,6.7,1.0,347.0,324.0,29.0,0.0,0.82,28.6,14.1,0.0,0.0,1.12,10.2,31.7
10,58,1,1,16.3,7.8,321,12.9,91.8,14.1,0.92,12.21,13.4,1.0,779.0,489.0,105.0,1.0,1.6,114.4,46.3,1.0,1.0,2.13,20.2,38.3
11,48,1,1,16.1,8.1,179,16.0,83.1,15.7,1.76,4.57,6.9,1.0,323.0,,,,1.11,28.8,22.1,0.0,0.0,,,
12,40,1,0,17.3,7.8,332,13.6,83.8,15.4,2.48,4.97,8.3,0.0,211.0,160.0,18.0,0.0,0.82,17.5,17.1,0.0,,1.12,10.2,33.4
13,40,1,0,16.4,7.9,285,12.8,89.7,16.7,3.31,5.85,10.1,1.0,260.0,95.0,38.0,0.0,0.83,22.3,25.3,0.0,,1.5,13.9,36.7
14,41,1,1,17.7,8.6,131,13.1,85.3,16.8,2.52,4.48,7.6,1.0,297.0,86.0,25.0,0.0,1.08,78.2,122.1,0.0,0.0,1.42,13.1,37.8
15,42,1,1,16.6,8.0,151,12.2,89.5,15.1,1.94,2.59,4.9,1.0,173.0,26.0,19.0,0.0,0.98,16.0,10.3,0.0,0.0,0.95,8.55,29.8
16,57,1,1,17.4,7.2,282,16.1,75.9,12.0,1.28,6.78,8.7,1.0,331.0,67.0,23.0,0.0,1.13,19.6,15.2,0.0,0.0,3.04,29.7,45.9
17,63,1,1,16.9,6.4,301,12.9,87.6,13.2,2,3.21,5.9,1.0,225.0,529.0,17.0,0.0,1.1,33.0,29.6,0.0,,1.08,9.73,33.4
18,59,1,0,16.8,7.3,226,13.3,92.9,14.4,2.58,2.98,6.3,0.0,249.0,70.0,50.0,0.0,0.87,26.9,26.2,,,5.96,9.84,54.9
19,43,1,1,16.5,8.9,274,14.2,95.7,15.1,1.81,4.69,9.5,0.0,177.0,99.0,23.0,0.0,0.97,18.4,20.8,0.0,0.0,,,
20,53,1,0,18.2,7.9,206,14.0,84.5,14.4,2.4,7.87,11.2,0.0,347.0,178.0,75.0,0.0,1.07,51.0,51.6,0.0,0.0,0.96,8.64,31.7
21,40,1,0,17.5,6.0,336,13.7,86.3,13.8,2.96,6.32,12.6,0.0,171.0,,,,0.94,16.4,18.9,0.0,0.0,,,
22,29,1,0,17.1,7.5,222,12.7,95.4,16.8,2.29,2.7,6.0,0.0,177.0,109.0,14.0,0.0,1.67,20.9,17.2,0.0,0.0,1.19,10.8,31.6
23,33,2,1,16.1,7.5,289,13.6,84.2,13.0,1.74,2.88,5.4,1.0,218.0,,,,0.68,18.2,11.4,1.0,,,,
24,18,2,0,16.4,7.6,353,13.9,83.5,13.4,3.96,5.07,10.7,0.0,,,,,,,,,,,,
25,31,2,0,16.1,7.6,285,13.6,90.8,11.8,2.77,3.08,6.3,,162.0,96.0,14.0,0.0,0.62,16.3,11.2,,,,,
26,47,1,1,18.6,6.4,189,17.0,67.7,11.9,0.84,3.1,4.7,1.0,,,,,,,,0.0,,,,
27,32,2,1,17.4,8.7,176,13.0,88.2,13.3,1.11,2.02,3.6,0.0,,,,,,,,,,,,
28,40,2,1,16.9,9.0,189,15.9,77.9,11.4,1.26,2.5,4.2,0.0,188.0,78.0,23.0,0.0,0.57,16.8,21.2,0.0,0.0,1.03,9.32,35.7
29,22,1,0,16.4,8.6,215,12.5,90.1,14.9,3.19,3.32,7.2,0.0,163.0,286.0,21.0,0.0,0.97,18.4,12.9,0.0,,1.33,12.2,33.3
30,43,2,1,17.5,8.1,221,17.8,65.2,10.8,1.97,3.12,5.5,0.0,199.0,39.0,18.0,0.0,0.61,15.7,10.4,0.0,0.0,,,
31,52,2,0,16.0,8.2,381,12.0,85.3,14.2,3.02,7.29,11.5,1.0,250.0,67.0,25.0,0.0,0.74,15.6,11.9,1.0,0.0,1.0,8.97,28.3
32,90,2,0,16.9,7.0,323,14.3,86.3,13.7,2.57,2.86,6.1,1.0,159.0,49.0,14.0,0.0,0.83,22.0,7.6,0.0,,0.91,8.14,29.9
33,46,2,0,16.6,9.0,204,14.9,89.5,11.6,2.12,4.1,6.8,1.0,231.0,56.0,11.0,0.0,0.64,28.6,27.7,0.0,,1.02,9.24,30.3
34,71,2,1,16.5,8.2,221,14.1,83.9,13.3,1.16,2.63,4.7,0.0,180.0,44.0,11.0,0.0,0.73,21.3,14.7,0.0,0.0,1.01,9.07,29.4
35,66,2,1,16.8,7.0,208,14.2,84.2,14.0,1.46,4.56,6.7,1.0,235.0,78.0,23.0,0.0,1.34,35.4,30.7,1.0,0.0,1.38,12.7,39.7
36,72,2,1,16.4,6.9,341,13.0,91.5,12.5,2.84,2.38,6.0,1.0,177.0,43.0,19.0,0.0,0.85,18.2,15.0,0.0,0.0,,,
37,25,2,0,17.2,9.0,283,13.3,91.9,13.1,2.4,3.52,6.6,0.0,177.0,77.0,15.0,0.0,0.69,23.2,20.5,0.0,,1.03,9.31,27.3
38,65,2,0,16.9,8.0,216,12.8,87.2,14.1,1.22,2.57,4.4,,209.0,42.0,19.0,0.0,0.68,,,,,7.93,83.0,68.4
39,48,2,1,17.0,9.1,230,14.2,81.3,10.8,0.51,2.57,3.6,0.0,187.0,64.0,16.0,0.0,0.8,15.9,9.3,0.0,0.0,1.2,11.0,30.6
40,23,2,1,16.1,7.1,256,13.5,89.8,12.4,1.43,3.8,6.1,0.0,,,,,,,,,,,,
41,49,2,0,17.3,7.5,224,13.2,91.2,12.9,1.29,1.05,2.7,0.0,200.0,53.0,17.0,0.0,0.54,16.9,11.3,0.0,0.0,1.14,10.4,29.1
42,78,2,0,17.0,7.5,250,12.8,88.5,12.9,1.23,15.56,17.5,1.0,360.0,84.0,,0.0,0.98,,14.2,1.0,0.0,1.14,10.4,28.7
43,74,2,0,17.4,7.6,286,12.9,90.2,13.2,1.55,3.62,5.7,1.0,461.0,72.0,92.0,0.0,0.7,33.6,41.2,1.0,0.0,1.04,9.36,22.3
44,32,2,0,16.1,8.6,236,14.0,85.3,12.6,2.73,7.78,11.3,0.0,263.0,,,,0.6,20.8,14.6,0.0,0.0,,,
45,29,2,1,16.9,9.6,228,14.8,63.5,11.2,2.25,3.16,6.1,0.0,154.0,59.0,23.0,0.0,0.6,15.6,13.3,0.0,,1.0,8.99,31.1
46,37,2,0,15.9,7.5,330,13.2,89.0,14.3,1.38,4.47,6.5,0.0,191.0,68.0,20.0,0.0,0.57,16.4,20.6,0.0,,1.06,9.62,29.2
47,47,2,1,16.0,7.9,389,13.7,75.3,11.4,1.83,2.56,5.0,1.0,198.0,104.0,20.0,0.0,0.72,23.6,27.0,0.0,,1.1,9.98,31.3
48,31,2,0,15.9,8.4,208,12.8,88.3,14.3,2.42,4.07,7.2,0.0,193.0,93.0,22.0,0.0,0.69,16.7,17.4,0.0,,1.2,10.9,27.3
49,52,2,1,17.5,9.2,195,13.9,88.8,13.1,1.26,4.26,6.1,1.0,181.0,61.0,17.0,0.0,1,46.1,33.1,0.0,0.0,,,
50,42,2,0,16.0,6.9,377,12.6,90.4,13.4,2.23,8.91,12.0,0.0,262.0,297.0,25.0,0.0,0.79,17.7,20.6,0.0,,1.2,10.9,31.5
51,70,2,1,17.0,9.7,188,14.8,78.4,13.9,1.01,5.77,7.8,1.0,177.0,47.0,18.0,0.0,0.84,16.1,12.5,0.0,0.0,2.18,20.7,32.2
52,26,1,1,16.6,7.3,232,12.4,88.1,15.3,1.35,4.74,6.7,0.0,262.0,115.0,26.0,0.0,0.88,24.0,41.8,0.0,0.0,1.06,9.6,22.3
53,28,2,1,17.7,10.2,197,16.0,82.7,11.1,0.8,4.37,5.3,1.0,705.0,682.0,44.0,0.0,0.79,79.8,62.2,1.0,0.0,1.14,10.3,33.8
54,39,2,1,16.5,7.6,361,20.1,68.8,8.6,0.95,3.25,4.7,0.0,214.0,101.0,21.0,0.0,0.62,19.1,13.5,1.0,0.0,1.05,9.48,28.8
55,56,1,1,16.7,7.6,142,13.3,85.2,15.2,0.84,3.5,4.9,1.0,280.0,263.0,25.0,0.0,0.95,26.4,15.5,0.0,0.0,,,
56,46,1,0,17.3,10.4,209,13.8,88.7,15.8,2.67,5.28,9.1,0.0,181.0,87.0,28.0,0.0,0.74,19.8,34.2,0.0,0.0,0.91,8.12,26.4
57,30,2,0,16.9,8.6,228,12.4,89.8,13.5,2.61,2.14,5.2,0.0,167.0,59.0,20.0,0.0,0.61,15.0,10.0,0.0,0.0,1.34,12.3,31.9
58,40,1,0,17.1,9.6,232,12.4,89.5,16.4,2.44,3.84,7.1,0.0,227.0,164.0,34.0,0.0,0.98,21.9,24.4,0.0,0.0,1.06,9.58,29.1
59,23,1,0,17.0,7.5,142,12.9,88.0,16.0,1.91,3.13,5.9,0.0,204.0,71.0,32.0,0.0,0.96,21.0,17.6,0.0,,1.24,11.3,32.3
60,50,1,1,16.5,7.6,203,13.7,94.8,15.1,0.77,3.31,4.6,1.0,,,,,,,,,,,,
61,61,1,0,16.7,7.5,243,14.4,90.2,14.5,2.68,3.61,7.2,0.0,209.0,203.0,58.0,0.0,0.87,23.6,31.8,0.0,0.0,1.01,9.05,35.7
62,24,1,0,16.4,8.1,382,12.1,86.4,13.3,2.15,5.16,8.9,1.0,179.0,49.0,21.0,0.0,0.92,14.8,10.2,0.0,0.0,1.07,9.71,27.8
63,23,2,0,16.1,7.4,311,12.9,86.5,14.1,1.24,9.6,11.2,0.0,214.0,35.0,22.0,0.0,0.6,13.0,12.1,0.0,0.0,1.26,11.5,26.3
64,47,1,0,16.7,8.3,271,13.9,88.7,15.9,2.94,7.76,12.4,1.0,225.0,70.0,33.0,0.0,0.81,31.3,37.3,0.0,0.0,,,
65,70,1,1,16.8,10.0,150,12.2,94.2,14.2,1.37,5.19,7.2,1.0,223.0,135.0,29.0,0.0,1.09,20.9,24.9,0.0,0.0,1.13,10.3,28.0
66,22,2,1,16.5,8.3,342,16.9,72.9,11.4,1.08,5.27,7.3,0.0,239.0,,,,0.69,17.1,8.6,,0.0,1.11,10.1,
67,22,2,1,16.8,9.1,145,13.9,87.8,12.1,0.9,1.22,2.8,0.0,146.0,,,,0.62,9.3,6.6,0.0,,,,
68,45,2,0,16.9,7.9,266,15.4,75.7,12.3,1.23,4.26,6.0,1.0,424.0,56.0,66.0,0.0,0.62,30.3,15.9,0.0,0.0,1.05,9.5,25.2
69,43,2,1,17.5,10.4,204,15.2,84.2,12.2,3.01,2.62,6.2,0.0,178.0,48.0,16.0,0.0,0.69,19.7,9.2,1.0,0.0,0.94,8.46,24.2
70,56,1,1,17.2,7.0,168,13.4,90.5,15.5,1.45,5.72,7.6,1.0,361.0,214.0,40.0,,1.19,30.7,16.4,0.0,0.0,1.14,10.4,30.0
71,30,2,0,17.1,7.9,230,12.6,87.6,12.9,2.53,3.55,6.7,0.0,166.0,71.0,18.0,0.0,0.6,24.3,21.1,0.0,0.0,1.05,9.44,29.9
72,49,1,0,17.4,9.4,191,20.4,97.6,14.0,3.23,3.87,8.2,0.0,222.0,52.0,26.0,0.0,1.11,20.9,16.9,0.0,0.0,1.11,10.1,44.8
73,82,2,1,17.0,6.4,230,12.5,92.5,12.2,0.65,4.94,5.9,1.0,359.0,147.0,22.0,0.0,0.76,56.2,33.2,1.0,0.0,0.94,8.4,25.8
74,53,2,0,16.3,7.9,296,12.8,88.5,12.5,2.5,5.36,8.9,,249.0,83.0,18.0,0.0,0.64,34.9,56.8,0.0,,0.96,8.63,32.3
75,27,1,0,16.2,8.1,301,14.2,81.7,14.1,2.42,5.32,8.9,0.0,194.0,182.0,25.2,0.0,0.75,18.3,12.3,0.0,0.0,,,
76,28,1,1,16.8,7.9,242,12.8,85.1,14.3,1.18,5.09,7.3,1.0,192.0,62.0,15.0,0.0,0.88,28.5,48.7,0.0,0.0,,,
77,44,1,1,16.6,7.8,192,12.6,90.2,15.4,1.51,2.12,4.5,0.0,182.0,167.0,18.2,0.0,1.78,20.9,12.5,0.0,0.0,1.03,9.3,29.6
78,23,1,1,17.3,6.9,229,13.0,86.2,14.6,2,5.52,8.6,1.0,199.0,195.0,20.0,0.0,1.07,22.5,29.6,0.0,0.0,1.17,10.6,28.1
79,37,2,0,18.5,9.0,234,14.9,76.4,11.0,1.36,3.14,5.1,0.0,216.0,590.0,21.0,0.0,0.87,52.5,78.0,1.0,,1.02,9.15,27.2
80,23,2,0,17.7,11.6,116,15.3,82.0,11.8,2.57,3.53,7.3,0.0,355.0,58.0,54.0,0.0,0.9,26.6,20.0,0.0,0.0,,,
81,30,2,0,16.2,7.7,247,13.2,85.2,14.4,3.14,3.81,7.9,0.0,236.0,66.0,30.0,0.0,"<0,04",10.3,7.7,,,1.34,12.3,34.7
82,18,2,1,16.9,8.3,164,12.8,90.3,12.2,2.23,3.38,6.4,0.0,210.0,61.0,27.0,0.0,0.75,17.5,6.3,0.0,0.0,1.02,9.18,28.8
83,40,2,0,16.9,7.2,256,16.8,80.6,11.1,2.23,2.9,6.0,0.0,,86.0,12.0,,0.57,17.5,,0.0,0.0,,,
84,30,2,0,16.4,6.8,313,13.4,88.7,13.9,1.56,4.08,6.3,1.0,,,,,,,,,,,,
85,31,2,0,17.1,8.3,232,13.7,82.5,12.5,1.82,2.54,4.8,0.0,152.0,43.0,18.0,0.0,0.59,16.1,14.7,0.0,0.0,0.9,8.07,29.9
86,32,2,1,17.3,10.7,178,16.2,74.7,11.2,0.85,3.91,5.2,0.0,205.0,111.0,17.0,0.0,0.57,20.8,15.0,0.0,0.0,,,
87,76,2,1,16.3,8.9,179,14.0,88.9,13.3,1.63,5.72,8.6,0.0,276.0,,,,1.12,25.3,14.7,0.0,0.0,,,
88,23,2,0,16.4,7.4,255,13.4,84.2,11.9,1.03,4.62,6.2,1.0,204.0,,,,0.53,78.4,72.5,1.0,0.0,,,
89,28,2,1,16.4,8.6,187,13.1,87.5,12.7,1.27,3.34,5.2,1.0,133.0,38.0,11.0,0.0,0.44,11.9,11.4,0.0,,0.99,8.85,32.1
90,66,2,0,18.1,9.0,272,16.8,75.2,10.3,1.23,4.46,6.2,1.0,,,,0.0,1.6,,,1.0,,1.19,10.8,29.7
91,33,2,1,16.4,8.4,188,14.0,83.3,11.4,1.63,2.31,4.2,0.0,264.0,376.0,21.0,0.0,0.73,28.5,21.4,0.0,0.0,1.16,10.6,31.5
92,22,2,0,16.8,7.2,334,13.4,89.5,14.3,3.22,3.84,7.8,0.0,193.0,80.0,26.0,0.0,0.65,14.5,4.9,0.0,0.0,,,
93,60,1,1,16.1,9.0,214,12.3,88.8,12.2,2.01,5.8,8.5,1.0,280.0,80.0,22.0,0.0,0.62,18.5,11.0,0.0,0.0,1.19,10.8,34.8
94,30,2,0,16.6,8.2,347,12.2,95.8,13.8,2.53,4.39,7.6,0.0,166.0,64.0,16.0,0.0,0.66,20.0,12.2,0.0,0.0,,,
95,49,2,0,16.7,7.4,423,12.9,81.1,10.8,1.75,6.55,8.8,1.0,228.0,47.0,23.0,0.0,1.02,20.9,14.9,0.0,0.0,,,
96,49,2,0,16.6,7.7,407,13.5,80.8,10.6,2.04,9.22,12.5,1.0,238.0,37.0,40.0,0.0,0.68,16.5,10.8,0.0,0.0,,,79.4
97,81,2,1,16.3,9.3,181,15.0,81.4,12.8,1.35,4.38,6.2,1.0,316.0,161.0,34.0,0.0,0.96,29.7,18.3,1.0,,1.01,9.12,35.1
98,45,2,1,17.5,7.6,254,13.0,84.3,12.1,4.41,3.81,8.8,1.0,246.0,73.0,37.0,0.0,0.76,25.7,22.7,,,0.96,8.63,23.8
99,83,2,0,17.8,11.9,112,16.5,80.9,11.7,0.85,21.39,23.0,1.0,344.0,45.0,34.0,1.0,1.12,120.2,153.8,1.0,1.0,4.22,42.1,32.8
100,67,2,1,16.1,7.2,279,14.0,86.9,11.8,0.91,4.88,6.8,1.0,223.0,87.0,14.0,0.0,0.8,23.9,14.8,1.0,0.0,1.01,9.07,27.4
101,36,2,0,17.3,8.3,267,16.1,73.2,12.5,2.43,3.32,6.4,1.0,265.0,71.0,33.8,,0.78,16.8,19.6,0.0,0.0,0.97,8.7,27.3
102,70,2,0,16.2,7.8,296,14.9,87.2,13.0,0.97,8.76,10.4,1.0,247.0,158.0,47.0,0.0,0.77,16.7,11.0,1.0,0.0,0.97,8.74,26.1
103,72,2,1,17.9,9.2,210,17.9,67.9,10.6,0.62,2.68,3.5,1.0,415.0,77.0,36.0,0.0,0.76,36.5,17.7,1.0,0.0,1.05,9.51,31.9
104,58,2,0,16.2,7.9,252,13.5,83.1,13.5,2.87,3.18,6.7,0.0,217.0,90.0,16.0,0.0,0.86,18.3,14.8,1.0,,1.13,10.3,32.4
105,42,2,1,16.6,7.9,263,12.3,91.4,15.4,1.72,2.66,5.1,0.0,186.0,66.0,21.0,0.0,0.65,16.8,17.0,0.0,,1.85,17.4,40.7
106,77,2,1,16.1,9.6,200,15.6,68.3,10.9,3.07,3.09,6.8,1.0,207.0,,,,0.88,27.0,26.0,0.0,0.0,,,
107,28,1,1,16.6,8.6,206,12.4,86.9,15.4,1.17,6.68,8.7,1.0,288.0,271.0,26.0,0.0,0.91,39.7,88.6,0.0,0.0,4.43,44.5,58.6
108,20,1,0,17.0,8.8,217,13.1,86.8,16.7,2.17,4.3,7.4,0.0,206.0,227.0,21.0,0.0,0.84,18.9,24.6,0.0,0.0,1.06,9.59,25.5
109,21,1,0,15.9,9.3,231,12.9,85.0,15.6,2.35,4.31,7.4,0.0,211.0,98.0,22.0,0.0,1.1,39.1,53.1,0.0,0.0,1.05,9.52,32.2
110,21,1,1,16.8,8.1,143,13.6,88.9,14.9,0.93,1.74,3.5,0.0,165.0,101.0,19.0,0.0,1.07,18.4,17.2,0.0,0.0,1.14,10.4,32.0
111,29,1,1,16.6,8.1,297,13.6,83.2,14.8,0.71,5.96,7.6,1.0,189.0,69.0,16.0,0.0,0.88,26.0,44.8,0.0,0.0,1.14,10.3,27.2
112,27,1,1,17.0,8.1,138,13.2,88.4,15.3,1.2,3.64,5.7,0.0,150.0,109.0,15.0,0.0,0.88,23.5,14.0,0.0,,1.25,11.4,35.2
113,47,1,0,16.8,8.3,236,12.8,88.4,14.7,2.44,3.78,7.2,0.0,167.0,124.0,18.0,0.0,1.1,13.2,11.8,0.0,0.0,,,
114,52,1,0,16.4,7.9,186,13.4,91.0,14.2,1.53,2.76,5.0,1.0,195.0,147.0,18.0,0.0,1.01,23.2,17.8,0.0,0.0,0.98,8.84,27.5
115,19,2,1,17.0,9.3,200,12.2,92.1,15.0,1.72,3.36,5.9,0.0,166.0,,,,0.61,16.3,8.9,0.0,,,,
116,25,2,0,16.3,8.4,202,13.1,85.5,11.8,1.17,5.58,6.9,1.0,166.0,,,,0.66,18.2,12.6,1.0,0.0,,,
117,43,1,1,16.3,7.4,202,13.1,88.1,14.7,1.54,2.32,4.3,0.0,184.0,131.0,17.9,0.0,0.89,19.9,18.4,0.0,,0.97,8.73,26.1
118,66,1,1,16.7,10.5,219,13.4,85.2,14.1,1.16,3.96,6.3,1.0,222.0,71.0,15.0,0.0,1.36,26.5,28.9,1.0,0.0,1.14,10.4,31.4
119,83,1,0,18.1,7.1,242,18.1,85.1,9.8,2.15,0.16,2.6,1.0,231.0,38.0,39.0,0.0,0.68,14.2,4.5,0.0,0.0,3.79,37.6,47.5
120,68,2,0,17.2,9.2,161,16.6,79.0,12.0,2.14,3.66,6.5,0.0,255.0,33.0,19.0,0.0,0.96,37.0,26.5,0.0,0.0,,,25.7
121,74,1,1,16.6,8.6,96,14.3,89.4,13.8,1.42,2.47,4.4,1.0,227.0,650.0,24.0,0.0,1.31,37.6,15.2,0.0,0.0,,,
122,71,1,1,17.3,7.6,220,14.0,88.0,11.9,1.24,4.24,6.6,0.0,222.0,159.0,22.0,0.0,1.08,23.0,16.5,0.0,,1.11,10.0,27.9
123,42,2,0,16.3,9.3,214,13.1,89.0,13.3,1.6,5.56,7.7,0.0,149.0,51.0,12.0,0.0,0.62,15.7,16.9,0.0,0.0,,,
124,52,2,1,17.8,8.7,209,11.9,88.1,13.0,1.8,2.53,4.7,1.0,267.0,45.0,31.0,0.0,0.78,19.7,14.8,0.0,,0.99,8.88,29.3
125,56,1,0,17.9,6.6,403,18.1,75.9,10.8,0.89,8.86,10.5,1.0,160.0,11.0,16.0,,0.76,14.6,7.7,1.0,,,,26.4
126,39,1,0,16.9,7.7,345,12.5,86.8,15.8,3.27,5.54,10.2,1.0,204.0,43.0,23.0,0.0,1.1,30.7,70.4,1.0,0.0,1.06,9.57,29.6
127,27,1,1,16.6,7.6,212,13.4,83.5,15.4,2.01,3.06,5.7,0.0,203.0,79.0,18.0,0.0,1.07,34.0,66.5,0.0,0.0,1.07,9.63,31.5
128,21,1,1,15.7,8.1,214,12.6,89.0,16.4,0.86,4.57,6.6,0.0,,,,,,,,,,,,
129,71,2,1,16.2,8.0,306,12.5,89.3,12.0,0.59,7.07,7.9,1.0,413.0,126.0,15.0,0.0,0.55,45.2,48.5,0.0,0.0,1.19,10.8,33.5
130,50,2,0,16.7,8.6,227,17.0,91.5,10.7,1.43,6.19,9.4,1.0,308.0,104.0,25.0,0.0,2.86,15.5,20.2,1.0,1.0,,,
131,60,2,0,16.7,8.3,278,14.3,79.8,12.3,1.87,3.48,5.9,0.0,214.0,122.0,18.0,0.0,0.72,15.1,13.8,0.0,0.0,0.95,8.46,32.9
132,52,2,0,17.8,7.8,173,12.8,88.5,12.9,1.02,1.82,3.3,1.0,197.0,108.0,13.0,0.0,0.95,30.6,41.4,1.0,0.0,0.94,8.41,26.5
133,46,2,1,16.2,7.5,301,13.1,87.8,13.1,2.42,6.47,9.6,1.0,310.0,164.0,31.0,0.0,0.79,25.1,26.7,0.0,0.0,1.08,9.73,28.7
134,46,2,1,16.9,7.9,210,12.6,88.4,12.6,2.18,2.98,5.9,1.0,236.0,,,,0.77,28.6,48.5,0.0,0.0,0.92,8.19,27.5
135,20,2,1,16.1,8.0,208,13.2,89.8,13.8,0.75,5.76,6.9,0.0,174.0,,,,0.7,13.6,9.8,0.0,,,,
136,66,2,1,16.3,8.4,199,13.3,91.7,13.5,1.75,3.4,5.5,1.0,332.0,295.0,30.0,0.0,0.63,25.4,16.4,0.0,0.0,0.98,8.76,26.2
137,72,2,1,17.1,6.8,295,12.8,95.5,9.8,0.36,4.37,4.8,1.0,385.0,108.0,24.0,0.0,0.66,91.8,11.9,1.0,0.0,1.05,9.44,31.7
138,50,2,1,16.5,7.5,300,12.9,85.4,13.9,2.58,2.83,5.9,1.0,,,,,,,,0.0,,1.41,13.0,28.3
139,73,2,1,17.2,6.9,153,14.4,95.2,12.4,1.79,3.36,5.4,1.0,560.0,166.0,39.0,0.0,1.1,31.0,11.0,0.0,0.0,,,
140,60,2,1,17.2,8.7,167,12.5,89.8,14.5,1.33,2.02,3.8,0.0,358.0,135.0,46.0,0.0,0.95,35.4,30.0,0.0,0.0,1.12,10.2,22.0
141,59,2,1,17.9,9.9,104,16.0,80.7,11.2,1.66,3.54,5.6,1.0,273.0,,,,0.69,19.2,15.4,1.0,,,,
142,68,2,1,18.5,9.3,104,13.4,88.2,12.5,1.46,3.49,5.3,1.0,288.0,84.0,15.0,0.0,1.2,22.4,12.1,,,1.06,9.55,31.0
143,62,2,1,16.6,8.1,232,13.3,90.3,12.1,1.2,2.91,4.6,1.0,175.0,86.0,22.0,0.0,0.97,24.4,24.8,0.0,0.0,1.1,9.94,34.8
144,73,2,1,16.9,8.1,418,16.0,81.8,12.0,1.29,2.86,4.7,1.0,382.0,58.0,25.0,0.0,0.74,32.3,13.6,0.0,0.0,0.95,8.51,25.9
145,51,2,1,17.4,7.8,101,15.3,86.0,11.0,0.75,1.56,2.6,0.0,184.0,,,,0.98,27.6,64.1,1.0,0.0,,,
146,64,1,1,16.3,7.3,198,12.4,84.7,14.4,1.1,4.75,6.3,0.0,216.0,82.0,23.0,0.0,0.99,18.2,12.0,1.0,0.0,0.97,8.69,29.7
147,82,1,1,16.6,9.1,131,13.6,87.7,14.6,1.25,2.98,4.6,1.0,345.0,374.0,30.0,0.0,2.19,43.3,21.3,0.0,0.0,1.55,14.4,47.5
148,50,2,1,16.2,7.4,291,13.0,77.5,12.4,1.44,1.9,4.3,1.0,172.0,70.0,15.0,0.0,0.78,26.7,17.0,0.0,0.0,0.99,8.93,30.5
149,29,2,0,16.6,8.7,241,13.9,81.3,12.8,2.48,8.62,11.9,0.0,,,,,,,,,,,,
150,56,2,1,17.4,9.2,234,13.4,89.6,12.4,0.99,3.26,4.6,1.0,239.0,,,,0.95,23.8,14.7,0.0,0.0,,,
151,71,2,0,16.1,8.0,277,17.5,79.6,12.7,1.6,5.51,8.3,1.0,227.0,122.0,16.0,0.0,0.96,15.0,10.6,0.0,0.0,7.12,74.0,64.1
152,67,2,1,17.4,8.8,212,13.9,89.3,10.3,1.67,2.65,4.9,0.0,181.0,93.0,17.0,0.0,0.79,22.6,24.8,0.0,0.0,1.07,9.64,28.8
153,26,2,0,17.0,7.5,239,13.0,82.9,13.0,2.22,3.36,6.3,1.0,191.0,107.0,16.0,0.0,0.75,16.0,11.4,0.0,0.0,,,
154,40,2,1,17.0,8.4,125,17.5,88.2,11.5,1.35,1.95,3.8,1.0,155.0,49.0,15.0,0.0,0.59,13.9,9.0,1.0,0.0,1.03,9.3,29.5
155,40,2,1,16.6,8.1,335,12.7,88.1,12.4,3.14,3.59,7.4,1.0,186.0,74.0,16.0,0.0,0.61,11.3,13.7,0.0,0.0,1.07,9.64,
156,48,2,1,16.8,7.0,276,12.1,89.3,13.3,1.4,3.64,5.8,1.0,226.0,116.0,13.0,0.0,0.67,26.5,25.5,0.0,0.0,1.06,9.61,29.2
157,36,2,0,16.0,7.7,430,15.2,77.2,11.1,1.99,4.33,7.1,1.0,275.0,110.0,26.0,0.0,0.77,20.1,14.1,0.0,0.0,0.91,8.16,26.7
158,32,1,1,15.9,9.8,252,14.0,86.3,14.8,2.04,5.96,8.8,1.0,191.0,121.0,24.0,0.0,0.95,23.6,30.4,0.0,0.0,,,
159,28,2,0,16.2,8.8,293,13.8,90.0,15.1,2.31,5.02,8.4,0.0,160.0,,,,0.72,14.8,15.9,0.0,0.0,,,
160,28,2,1,16.1,9.0,204,13.6,89.8,14.1,1.24,3.05,5.2,0.0,265.0,71.0,49.0,0.0,0.72,22.1,14.5,0.0,0.0,1.04,9.37,25.3
161,56,2,1,16.6,10.1,220,13.4,88.2,13.9,1.88,6.78,9.3,,302.0,70.0,36.0,0.0,0.91,21.2,14.1,,0.0,2.7,26.1,44.1
162,23,2,1,16.6,8.0,292,13.3,86.8,12.3,1.77,5.38,7.4,,268.0,76.0,22.0,0.0,0.54,20.0,14.0,0.0,0.0,,,
163,41,2,1,16.8,8.3,296,13.5,77.7,13.2,1.59,3.71,5.6,1.0,227.0,70.0,24.0,0.0,0.74,24.7,29.5,0.0,,1.09,9.87,29.9
164,48,2,0,16.3,8.6,668,17.0,70.7,8.7,3.04,7.02,11.2,,304.0,186.0,22.0,0.0,0.84,18.4,14.5,1.0,0.0,,,
165,48,2,0,17.2,8.6,489,17.5,72.7,9.6,2.31,5.35,8.6,,,,,,,,,1.0,0.0,,,
166,34,2,0,17.8,9.3,307,16.0,78.1,10.7,1.93,4.18,6.7,0.0,356.0,99.0,,0.0,0.62,30.0,18.2,0.0,0.0,,,
167,74,2,1,16.3,7.2,213,14.1,81.6,12.2,1.35,2.59,4.6,0.0,,,,,,,,,,,,
168,54,2,0,16.6,9.8,169,13.3,85.7,11.5,1.52,5.88,7.8,1.0,306.0,,,,0.59,25.1,10.7,0.0,,,,
169,65,2,1,16.6,7.1,307,14.8,78.4,12.1,1.27,4.15,6.0,1.0,230.0,90.0,13.0,0.0,0.61,18.3,17.3,1.0,0.0,0.96,8.66,25.5
170,50,2,1,16.6,8.3,198,13.3,84.7,12.2,2.41,1.03,4.0,0.0,204.0,154.0,26.0,0.0,0.8,25.1,23.3,0.0,0.0,0.94,8.39,28.1
171,91,2,1,16.7,7.9,253,14.4,82.7,12.7,1.35,3.67,5.7,1.0,234.0,152.0,18.0,0.0,0.81,22.3,12.2,0.0,,1.05,9.51,33.0
172,33,2,1,17.2,8.6,126,12.9,94.7,13.1,1.47,1.55,3.3,0.0,199.0,58.0,15.0,0.0,0.71,19.8,13.9,1.0,0.0,1.1,10.0,26.2
173,72,2,1,16.5,10.3,168,13.3,85.8,14.3,2.19,2.16,4.8,0.0,207.0,41.0,19.0,0.0,0.78,22.9,10.6,0.0,0.0,1.22,11.1,29.8
174,37,2,0,17.0,8.3,320,13.4,85.1,12.0,2.64,6.14,9.7,0.0,207.0,61.0,20.0,0.0,0.79,29.8,27.3,1.0,0.0,0.93,8.29,20.1
175,75,1,0,17.3,8.8,231,16.5,96.2,11.2,1.2,17.5,19.7,1.0,230.0,77.0,43.0,0.0,0.78,16.4,19.9,0.0,0.0,1.1,9.93,28.5
176,45,1,0,17.6,7.6,331,12.5,88.1,14.7,5.22,3.56,9.6,0.0,233.0,152.0,27.0,0.0,0.81,40.6,78.5,0.0,0.0,1.2,11.0,31.7
177,27,2,1,17.7,9.9,211,14.2,89.2,13.4,1.16,2.36,4.2,0.0,165.0,59.0,13.0,0.0,0.81,18.7,11.0,0.0,0.0,1.43,13.2,34.2
178,80,1,1,18.2,8.9,322,16.5,99.4,14.4,1.03,9.47,8.8,1.0,465.0,626.0,53.0,1.0,1.2,75.4,23.7,1.0,1.0,2.45,23.6,49.1
179,77,1,1,17.5,9.1,162,14.3,88.6,12.9,1.07,2.56,4.4,1.0,232.0,,,,1.22,28.8,17.2,0.0,0.0,1.52,14.1,
180,37,1,1,17.9,10.0,175,13.5,87.0,15.2,1.05,2.77,4.4,1.0,256.0,77.0,32.0,0.0,0.81,26.3,12.5,0.0,0.0,4.25,42.5,56.9
181,65,1,1,17.3,8.1,257,14.0,78.6,12.9,1.04,3.59,5.5,1.0,317.0,80.0,52.0,0.0,1.03,27.0,12.1,0.0,0.0,,,
182,50,2,1,17.7,8.4,284,13.2,83.8,13.7,1.36,2.92,4.7,1.0,,153.0,,1.0,0.78,,,0.0,0.0,0.95,8.55,26.2
183,59,2,0,16.8,8.7,248,15.8,89.0,12.2,1.51,2.62,4.8,1.0,189.0,48.0,21.0,0.0,0.73,19.8,17.2,0.0,,0.95,8.56,28.4
184,64,2,0,16.6,7.9,259,14.0,90.5,13.4,2.46,5.78,9.5,1.0,202.0,76.0,21.0,0.0,0.81,19.9,9.6,0.0,,1.22,11.1,35.1
185,71,2,1,19.3,9.8,174,14.4,89.4,14.0,1.24,5.97,7.8,1.0,173.0,106.0,15.0,0.0,1.11,20.5,15.4,1.0,0.0,1.58,14.7,34.8
186,71,2,1,16.8,10.8,167,13.9,83.7,14.2,1.16,3.44,5.0,1.0,180.0,38.0,17.0,0.0,1.07,23.8,21.3,1.0,0.0,0.91,8.18,25.2
187,61,2,1,17.3,8.5,159,13.4,84.1,13.9,1.37,2.6,4.2,1.0,233.0,89.0,23.0,0.0,0.91,18.0,13.9,0.0,0.0,1.09,9.84,33.7
188,67,2,1,18.4,10.4,155,13.7,85.3,13.1,2.31,3.06,5.9,0.0,222.0,68.0,17.0,0.0,0.64,27.2,18.3,0.0,0.0,,,
189,61,2,1,16.9,9.0,268,13.5,84.0,14.3,1.27,2.09,3.6,1.0,228.0,87.0,18.0,0.0,0.84,31.2,29.3,0.0,0.0,0.95,8.5,26.2
190,38,1,0,17.2,8.8,271,13.2,85.2,14.0,1.86,4.63,7.0,0.0,216.0,139.0,18.0,0.0,0.91,42.1,48.3,0.0,0.0,1.16,10.6,30.4
191,77,1,1,16.2,6.5,201,14.7,95.3,12.8,1.63,5.43,7.6,1.0,323.0,74.0,29.0,0.0,1.07,25.6,20.1,0.0,0.0,1.31,12.0,41.8
192,35,1,0,17.2,7.6,242,12.4,89.9,15.9,2.62,2.92,6.3,0.0,181.0,118.0,16.0,0.0,0.88,18.4,19.8,0.0,0.0,0.97,8.7,29.0
193,69,1,0,17.4,6.6,430,13.8,88.6,16.3,0.82,8.61,10.6,1.0,439.0,108.0,45.3,0.0,0.98,57.5,60.7,1.0,0.0,1.27,11.6,39.5
194,25,1,0,16.0,7.7,249,14.3,84.9,15.5,3.1,3.07,7.3,0.0,163.0,122.0,19.0,0.0,1.02,17.5,18.0,0.0,,1.17,10.7,30.5
195,25,1,1,16.2,7.6,322,13.6,85.6,15.2,4.55,4.41,9.9,0.0,203.0,,,,0.93,33.5,54.0,0.0,0.0,,,
196,32,1,0,16.9,8.5,278,13.1,85.7,15.7,2.32,6.01,9.1,0.0,208.0,130.0,24.0,0.0,0.95,18.4,27.2,0.0,,1.13,10.3,27.3
197,36,1,0,17.2,7.3,317,12.9,86.8,14.7,2.42,4.13,7.1,0.0,334.0,88.0,25.0,0.0,0.77,161.1,279.4,0.0,0.0,1.14,10.3,29.1
198,88,1,0,17.7,6.2,295,23.1,85.7,8.1,1.31,5.35,7.2,1.0,299.0,,,,1.68,30.1,7.6,1.0,1.0,,,
199,60,2,1,17.6,8.8,225,18.9,69.4,9.1,2.17,2.73,5.3,0.0,298.0,37.0,32.0,0.0,0.7,21.4,13.2,1.0,0.0,1.1,10.0,25.2
200,68,2,1,16.8,7.9,164,13.9,83.6,12.5,2.18,3.75,7.1,1.0,205.0,79.0,18.0,0.0,0.71,22.2,16.8,0.0,1.0,1.05,9.44,19.2
201,62,2,1,16.5,8.8,169,12.5,89.7,12.0,1.44,1.29,3.0,1.0,252.0,47.0,14.0,0.0,0.63,20.5,12.3,0.0,0.0,1.02,9.2,27.4
202,54,2,0,16.3,7.8,323,15.5,75.9,11.5,2.26,3.43,6.4,1.0,312.0,99.0,43.0,0.0,0.78,37.6,44.6,0.0,0.0,1.0,8.98,27.3
203,60,2,1,16.4,7.3,349,14.8,76.4,11.6,0.82,3.8,5.4,1.0,233.0,121.0,20.0,0.0,0.84,52.0,44.6,0.0,0.0,1.0,8.98,31.7
204,55,2,1,16.4,7.9,178,13.6,87.7,13.2,1.65,1.33,3.5,1.0,179.0,71.0,19.0,0.0,0.86,21.5,15.3,0.0,,1.05,9.45,27.7
205,49,2,1,16.8,7.4,299,13.3,87.4,15.3,2.44,6.94,10.1,0.0,251.0,79.0,38.0,0.0,0.63,16.6,8.4,0.0,0.0,0.98,8.76,26.3
206,70,2,0,17.1,8.2,284,14.4,90.8,11.4,2.52,3.43,6.5,0.0,217.0,59.0,13.0,0.0,0.79,23.6,15.4,0.0,0.0,1.36,12.5,30.8
207,73,2,1,17.1,8.2,197,13.7,91.6,11.8,1.3,2.79,4.7,1.0,400.0,71.0,24.0,0.0,0.91,27.3,20.5,0.0,0.0,3.35,32.9,54.7
208,64,2,1,17.0,9.5,222,16.0,74.3,11.3,0.91,3.37,4.5,1.0,244.0,211.0,46.0,1.0,0.91,21.2,11.1,0.0,,2.52,24.2,46.0
209,57,2,1,16.0,8.9,185,14.2,84.8,13.1,2.23,3.47,6.6,1.0,228.0,89.0,19.0,0.0,1.07,30.0,24.9,0.0,0.0,1.14,10.3,28.7
210,62,2,1,15.9,8.2,252,12.9,83.1,12.1,1.34,1.9,4.7,0.0,279.0,129.0,22.0,0.0,0.84,23.7,12.1,0.0,0.0,11.2,121.0,49.6
211,66,2,1,16.5,9.2,161,12.3,91.3,12.5,1.35,0.91,2.6,0.0,359.0,116.0,50.0,0.0,0.69,22.7,11.6,0.0,0.0,0.94,8.41,27.7
212,63,2,1,16.6,9.1,268,13.1,88.4,14.6,1.87,1.81,4.2,0.0,219.0,45.0,19.2,0.0,0.7,23.7,18.2,0.0,0.0,1.16,10.6,28.7
213,93,2,1,16.6,7.6,305,16.7,73.1,11.2,1.51,4.19,6.4,1.0,187.0,57.0,19.0,0.0,0.84,23.5,13.7,0.0,0.0,1.03,9.26,31.0
214,91,2,1,18.5,9.0,140,16.4,92.5,13.3,0.54,13.03,15.1,1.0,473.0,,,,1.62,,38.0,1.0,1.0,,,
215,70,2,1,16.5,7.6,309,14.4,84.3,13.7,1.63,4.29,6.4,0.0,253.0,72.0,25.0,0.0,0.79,17.8,11.3,0.0,0.0,2.7,26.1,39.4
216,82,2,1,17.6,7.6,297,14.2,89.7,13.1,1.35,3.76,5.9,1.0,194.0,48.0,17.0,0.0,0.99,19.4,7.9,1.0,0.0,1.11,10.0,33.1
217,88,2,1,16.9,7.5,168,14.1,86.0,12.6,0.66,2.04,2.8,1.0,316.0,92.0,19.0,0.0,0.98,25.8,8.5,1.0,0.0,,,
218,24,1,0,17.4,9.4,207,12.3,87.4,15.9,2.08,3.46,6.3,0.0,186.0,210.0,16.0,0.0,0.92,28.1,48.6,0.0,,1.19,10.9,28.7
219,58,1,1,17.2,7.9,185,13.1,84.8,14.4,1.31,5.14,6.9,1.0,370.0,239.0,48.0,0.0,0.89,31.4,37.2,0.0,,1.33,12.2,33.7
220,45,1,0,16.6,7.6,285,12.7,80.2,14.5,2.1,3.62,6.7,0.0,181.0,89.0,20.0,0.0,0.93,23.6,28.5,0.0,0.0,0.99,8.86,30.7